{"text_format":"1","workbook":"xlsx","n_sheets":2,"sheets":["MV","Source"],"not_rendered":{"charts":0,"images":0,"macros":1,"external_links":0,"defined_names":0,"comments":0,"pivot_tables":0},"unopened":[],"bounds":{"document_bytes":16777216,"sheet_cells":100000,"rows_first":2000,"rows_last":500,"rows_between":2000,"halvings":0,"cell_chars":16384,"cell_head_chars":4096},"cells_cut":0,"cells_raw":0,"read":"whole","date_system":"1900"}

{"sheet":"MV","index":0,"n_rows":399,"n_cols":9,"rows_kept":399,"cut":false,"hidden":false,"merged":[[398,4,398,8],[395,4,395,8],[342,4,342,7],[196,4,196,7],[160,4,160,7],[230,4,230,7],[391,4,391,7],[390,4,390,7],[307,4,307,7],[394,4,394,8],[397,4,397,8],[93,4,93,7],[264,4,264,7],[104,4,104,7],[41,4,41,7],[68,4,68,7],[121,4,121,7]]}
[null,null,null,null,"Vardas Pavardė [Tab.Nr.]\nName Surname"]
[null,null,null,null,"Anglų filologijos katedra"]
[]
[null,null,null,null,"Metai "]
[null,null,null,null,"Mokslinė veikla\nResearch Activity"]
[null,null,null,null,"Mokslinės konferencijos ir meno renginiai, mokslo populiarinimas\nScientific conferences and arts events, science popularisation","Mat. vnt.\nMeasurement unit","Kiekis\nQuantity","Skiriami taškai\nPoints","Iš viso:\nTotal:"]
[null,null,null,null,"Dalyvavimas\nParticipation"]
[{"$f":"TRIM(MID($E$1,FIND(\"[\",$E$1,1)+1,FIND(\"]\",$E$1,1)-FIND(\"[\",$E$1,1)-1))","v":"Tab.Nr."},{"$f":"VLOOKUP($E$2,Source!$A$5:$B$78,2,FALSE)","v":"lll030900000"},{"$f":"$E$3","v":0},4354,"Padaryti kviestiniai pranešimai tarptautiniuose mokslo renginiuose\nInvited presentations made at international science events","vnt.\nunit",0,25,{"$f":"G8*H8","v":0}]
[{"$f":"TRIM(MID($E$1,FIND(\"[\",$E$1,1)+1,FIND(\"]\",$E$1,1)-FIND(\"[\",$E$1,1)-1))","v":"Tab.Nr."},{"$f":"VLOOKUP($E$2,Source!$A$5:$B$78,2,FALSE)","v":"lll030900000"},{"$f":"$E$3","v":0},4355]
[{"$f":"TRIM(MID($E$1,FIND(\"[\",$E$1,1)+1,FIND(\"]\",$E$1,1)-FIND(\"[\",$E$1,1)-1))","v":"Tab.Nr."},{"$f":"VLOOKUP($E$2,Source!$A$5:$B$78,2,FALSE)","v":"lll030900000"},{"$f":"$E$3","v":0},4356,"Padaryti pranešimai tarptautiniuose mokslo renginiuose\nPresentations made at international science events","vnt.\nunit",0,15,{"$f":"G10*H10","v":0}]
["Tab.Nr.",{"$f":"VLOOKUP($E$2,Source!$A$5:$B$78,2,FALSE)","v":"lll030900000"},0,4357]
["Tab.Nr.",{"$f":"VLOOKUP($E$2,Source!$A$5:$B$78,2,FALSE)","v":"lll030900000"},0,4358,"Padaryti kviestiniai pranešimai respublikiniuose mokslo renginiuose\nInvited presentations made at national science events","vnt.\nunit",0,15,{"$f":"G12*H12","v":0}]
["Tab.Nr.",{"$f":"VLOOKUP($E$2,Source!$A$5:$B$78,2,FALSE)","v":"lll030900000"},0,4359]
["Tab.Nr.",{"$f":"VLOOKUP($E$2,Source!$A$5:$B$78,2,FALSE)","v":"lll030900000"},0,4360,"Padaryti pranešimai kituose mokslo renginiuose \nPresentations made at other science events ","vnt.\nunit",0,5,{"$f":"G14*H14","v":0}]
["Tab.Nr.",{"$f":"VLOOKUP($E$2,Source!$A$5:$B$78,2,FALSE)","v":"lll030900000"},0,4361]
[null,null,null,null,"Organizavimas\nOrganizing"]
["Tab.Nr.",{"$f":"VLOOKUP($E$2,Source!$A$5:$B$78,2,FALSE)","v":"lll030900000"},0,4363,"Tarptautinio mokslo ir meno renginio organizacinio arba mokslo komiteto pirmininkas\nChairperson of the organising or scientific committee of international science and arts event","vnt.\nunit",0,30,{"$f":"G17*H17","v":0}]
["Tab.Nr.",{"$f":"VLOOKUP($E$2,Source!$A$5:$B$78,2,FALSE)","v":"lll030900000"},0,4364]
["Tab.Nr.",{"$f":"VLOOKUP($E$2,Source!$A$5:$B$78,2,FALSE)","v":"lll030900000"},0,4365,"Tarptautinio mokslo ir meno renginio organizacinio arba mokslo komiteto narys\nMember of the organising or scientific committee of international science and arts event","vnt.\nunit",0,10,{"$f":"G19*H19","v":0}]
["Tab.Nr.",{"$f":"VLOOKUP($E$2,Source!$A$5:$B$78,2,FALSE)","v":"lll030900000"},0,4366]
["Tab.Nr.",{"$f":"VLOOKUP($E$2,Source!$A$5:$B$78,2,FALSE)","v":"lll030900000"},0,4367,"Kitų mokslo ir meno renginių organizacinio komiteto pirmininkas\nChairperson of the organising committee of other science and arts events","vnt.\nunit",0,10,0]
["Tab.Nr.",{"$f":"VLOOKUP($E$2,Source!$A$5:$B$78,2,FALSE)","v":"lll030900000"},0,4368]
["Tab.Nr.",{"$f":"VLOOKUP($E$2,Source!$A$5:$B$78,2,FALSE)","v":"lll030900000"},0,4369,"Kitų mokslo ir meno  renginių organizacinio komiteto narys\nMember of the organising committee of other science and arts events","vnt.\nunit",0,5,0]
["Tab.Nr.",{"$f":"VLOOKUP($E$2,Source!$A$5:$B$78,2,FALSE)","v":"lll030900000"},0,4370]
[null,null,null,null,"Populiarinimas\nPopularisation"]
["Tab.Nr.",{"$f":"VLOOKUP($E$2,Source!$A$5:$B$78,2,FALSE)","v":"lll030900000"},0,4383,"Paskaitų, konsultacijų, konkursų moksleiviams vedimas\nDelivering lectures, consultations and competitions for schoolchildren","vnt.\nunit",0,5,{"$f":"G26*H26","v":0}]
["Tab.Nr.",{"$f":"VLOOKUP($E$2,Source!$A$5:$B$78,2,FALSE)","v":"lll030900000"},0,4384]
["Tab.Nr.",{"$f":"VLOOKUP($E$2,Source!$A$5:$B$78,2,FALSE)","v":"lll030900000"},0,4387,"Renginių, konkursų, viktorinų moksleiviams organizavimas\nOrganising events, competitions and contests for schoolchildren","vnt.\nunit",0,8,{"$f":"G28*H28","v":0}]
["Tab.Nr.",{"$f":"VLOOKUP($E$2,Source!$A$5:$B$78,2,FALSE)","v":"lll030900000"},0,4388]
["Tab.Nr.",{"$f":"VLOOKUP($E$2,Source!$A$5:$B$78,2,FALSE)","v":"lll030900000"},0,4389,"Renginių su universiteto absolventais, darbdaviais organizavimas/vedimas\nOrganising/conducting events with university alumni and employers","vnt.\nunit",0,8,{"$f":"G30*H30","v":0}]
["Tab.Nr.",{"$f":"VLOOKUP($E$2,Source!$A$5:$B$78,2,FALSE)","v":"lll030900000"},0,4390]
["Tab.Nr.",{"$f":"VLOOKUP($E$2,Source!$A$5:$B$78,2,FALSE)","v":"lll030900000"},0,4391,"Viešos paskaitos visuomenei, diskusijų, seminarų vedimas\nDelivering public lectures, discussions, seminars for the community","vnt.\nunit",0,5,{"$f":"G32*H32","v":0}]
["Tab.Nr.",{"$f":"VLOOKUP($E$2,Source!$A$5:$B$78,2,FALSE)","v":"lll030900000"},0,4392]
["Tab.Nr.",{"$f":"VLOOKUP($E$2,Source!$A$5:$B$78,2,FALSE)","v":"lll030900000"},0,4393,"Meno, mokslo populiarinimo knygos\nScience and arts popularisation books","aut. l.\nquire",0,3,{"$f":"G34*H34","v":0}]
["Tab.Nr.",{"$f":"VLOOKUP($E$2,Source!$A$5:$B$78,2,FALSE)","v":"lll030900000"},0,4394]
["Tab.Nr.",{"$f":"VLOOKUP($E$2,Source!$A$5:$B$78,2,FALSE)","v":"lll030900000"},0,4395,"Mokslo populiarinimo filmai\nScience popularisation films","vnt.\nunit",0,5,{"$f":"G36*H36","v":0}]
["Tab.Nr.",{"$f":"VLOOKUP($E$2,Source!$A$5:$B$78,2,FALSE)","v":"lll030900000"},0,4396]
["Tab.Nr.",{"$f":"VLOOKUP($E$2,Source!$A$5:$B$78,2,FALSE)","v":"lll030900000"},0,4397,"Mokslo populiarinimo straipsniai, parodų katalogų straipsniai\nScience popularisation articles, articles of exhibition catalogues ","vnt.\nunit",0,4,{"$f":"G38*H38","v":0}]
["Tab.Nr.",{"$f":"VLOOKUP($E$2,Source!$A$5:$B$78,2,FALSE)","v":"lll030900000"},0,4398]
["Tab.Nr.",{"$f":"VLOOKUP($E$2,Source!$A$5:$B$78,2,FALSE)","v":"lll030900000"},0,4399,"Dalyvavimas televizijos ir radijo laidose, susitikimai su visuomene\nParticipation in TV and radio programmes, and meetings with the community","vnt.\nunit",0,2,{"$f":"G40*H40","v":0}]
["Tab.Nr.",{"$f":"VLOOKUP($E$2,Source!$A$5:$B$78,2,FALSE)","v":"lll030900000"},0,4400]
[null,null,null,null,"Iš viso:\nTotal:",null,null,null,{"$f":"I8+I10+I12+I14+I17+I19+I21+I23+I26+I28+I30+I32+I34+I36+I38+I40","v":0}]
[]
[null,null,null,null,"Leidybinis darbas, vertinimai\nPublication and translation work","Mat. vnt.\nMeasurement unit","Kiekis\nQuantity","Skiriami taškai\nPoints","Iš viso:\nTotal:"]
["Tab.Nr.",{"$f":"VLOOKUP($E$2,Source!$A$5:$B$78,2,FALSE)","v":"lll030900000"},0,4408,"Mokslinių žurnalų, registruotų Mokslinės infomacijos instituto (ISI) duomenų bazėse, redakcinės kolegijos pirmininkas, vyr. redaktorius\nChairperson, editor-in-chief of editorial board of scientific journals, registered in the Institute for Scientific Information (ISI) databases ","vnt.\nunit",0,30,{"$f":"G45*H45","v":0}]
["Tab.Nr.",{"$f":"VLOOKUP($E$2,Source!$A$5:$B$78,2,FALSE)","v":"lll030900000"},0,4409]
["Tab.Nr.",{"$f":"VLOOKUP($E$2,Source!$A$5:$B$78,2,FALSE)","v":"lll030900000"},0,4410,"Mokslinių žurnalų, registruotų Mokslinės infomacijos instituto (ISI) duomenų bazėse, redakcinės kolegijos atsakingas redaktorius, pirmininko pavaduotojas\nVice-chairperson, managing editor of editorial board of scientific journals, registered in the Institute for Scientific Information (ISI) databases ","vnt.\nunit",0,15,{"$f":"G47*H47","v":0}]
["Tab.Nr.",{"$f":"VLOOKUP($E$2,Source!$A$5:$B$78,2,FALSE)","v":"lll030900000"},0,4411]
["Tab.Nr.",{"$f":"VLOOKUP($E$2,Source!$A$5:$B$78,2,FALSE)","v":"lll030900000"},0,4412,"Mokslinių žurnalų, registruotų Mokslinės infomacijos instituto (ISI) duomenų bazėse, redakcinės kolegijos narys\nMember of editorial board of scientific journals, registered in the Institute for Scientific Information (ISI) databases ","vnt.\nunit",0,10,{"$f":"G49*H49","v":0}]
["Tab.Nr.",{"$f":"VLOOKUP($E$2,Source!$A$5:$B$78,2,FALSE)","v":"lll030900000"},0,4413]
["Tab.Nr.",{"$f":"VLOOKUP($E$2,Source!$A$5:$B$78,2,FALSE)","v":"lll030900000"},0,4414,"Mokslinių žurnalų, registruotų kitose tarptautinėse duomenų bazėse, redakcinės kolegijos pirmininkas, vyr. redaktorius\nChairperson, editor-in-chief of editorial board of scientific journals, registered in other international databases ","vnt.\nunit",0,20,{"$f":"G51*H51","v":0}]
["Tab.Nr.",{"$f":"VLOOKUP($E$2,Source!$A$5:$B$78,2,FALSE)","v":"lll030900000"},0,4415]
["Tab.Nr.",{"$f":"VLOOKUP($E$2,Source!$A$5:$B$78,2,FALSE)","v":"lll030900000"},0,4416,"Mokslinių žurnalų, registruotų kitose tarptautinėse duomenų bazėse, redakcinės kolegijos atsakingas redaktorius, pirmininko pavaduotojas\nVice-chairperson, managing editor of editorial board of scientific journals, registered in other international databases ","vnt.\nunit",0,12,{"$f":"G53*H53","v":0}]
["Tab.Nr.",{"$f":"VLOOKUP($E$2,Source!$A$5:$B$78,2,FALSE)","v":"lll030900000"},0,4417]
["Tab.Nr.",{"$f":"VLOOKUP($E$2,Source!$A$5:$B$78,2,FALSE)","v":"lll030900000"},0,4418,"Mokslinių žurnalų, registruotų kitose tarptautinėse duomenų bazėse, redakcinės kolegijos narys\nMember of editorial board of scientific journals, registered in other international databases","vnt.\nunit",0,8,{"$f":"G55*H55","v":0}]
["Tab.Nr.",{"$f":"VLOOKUP($E$2,Source!$A$5:$B$78,2,FALSE)","v":"lll030900000"},0,4419]
["Tab.Nr.",{"$f":"VLOOKUP($E$2,Source!$A$5:$B$78,2,FALSE)","v":"lll030900000"},0,4420,"Meno kūrinių albumo, katalogo sudarytojas\nCompiler of album or catalogue of exhibited artwork","vnt.\nunit",0,20,{"$f":"G57*H57","v":0}]
["Tab.Nr.",{"$f":"VLOOKUP($E$2,Source!$A$5:$B$78,2,FALSE)","v":"lll030900000"},0,4421]
["Tab.Nr.",{"$f":"VLOOKUP($E$2,Source!$A$5:$B$78,2,FALSE)","v":"lll030900000"},0,4422,"Kitų mokslinių ir mokslo populiarinimo žurnalų redakcinės kolegijos pirmininkas, vyr. redaktorius\nChairman, editor-in-chief of  editorial board of other scientific and science popularisation journals","vnt.\nunit",0,15,{"$f":"G59*H59","v":0}]
["Tab.Nr.",{"$f":"VLOOKUP($E$2,Source!$A$5:$B$78,2,FALSE)","v":"lll030900000"},0,4423]
["Tab.Nr.",{"$f":"VLOOKUP($E$2,Source!$A$5:$B$78,2,FALSE)","v":"lll030900000"},0,4424,"Kitų mokslinių ir mokslo populiarinimo žurnalų redakcinės kolegijos narys/vyr. redaktoriaus pavaduotojas/atsakingas redaktorius\nMember/deputy editor/managing editor of editorial board of other scientific and science popularisation journals ","vnt.\nunit",0,5,{"$f":"G61*H61","v":0}]
["Tab.Nr.",{"$f":"VLOOKUP($E$2,Source!$A$5:$B$78,2,FALSE)","v":"lll030900000"},0,4425]
["Tab.Nr.",{"$f":"VLOOKUP($E$2,Source!$A$5:$B$78,2,FALSE)","v":"lll030900000"},0,4428,"Projektų aprašų vertimas\nTranslation of project descriptions","aut. l.\nquire",0,5,{"$f":"G63*H63","v":0}]
["Tab.Nr.",{"$f":"VLOOKUP($E$2,Source!$A$5:$B$78,2,FALSE)","v":"lll030900000"},0,4429]
["Tab.Nr.",{"$f":"VLOOKUP($E$2,Source!$A$5:$B$78,2,FALSE)","v":"lll030900000"},0,4430,"Studijų programų savianalizės vertimas\nTranslation of study programmes self-assessments","aut. l.\nquire",0,4,{"$f":"G65*H65","v":0}]
["Tab.Nr.",{"$f":"VLOOKUP($E$2,Source!$A$5:$B$78,2,FALSE)","v":"lll030900000"},0,4431]
["Tab.Nr.",{"$f":"VLOOKUP($E$2,Source!$A$5:$B$78,2,FALSE)","v":"lll030900000"},0,4432,"Mokslinių straipsnių santraukų, universiteto laiškų, dokumentų vertimas\nTranslation of abstracts of scientific articles, university letters and documents","vnt.\nunit",0,1,{"$f":"G67*H67","v":0}]
["Tab.Nr.",{"$f":"VLOOKUP($E$2,Source!$A$5:$B$78,2,FALSE)","v":"lll030900000"},0,4433]
[null,null,null,null,"Iš viso:\nTotal:",null,null,null,{"$f":"I45+I47+I49+I51+I53+I55+I57+I59+I61+I63+I65+I67","v":0}]
[]
[null,null,null,null,"Visuomeninė ir meninė veikla\nPublic and artistic activity ","Mat. vnt.\nMeasurement unit","Kiekis\nQuantity","Skiriami taškai\nPoints","Iš viso:\nTotal:"]
["Tab.Nr.",{"$f":"VLOOKUP($E$2,Source!$A$5:$B$78,2,FALSE)","v":"lll030900000"},0,4435,"Autorinės meno kūrinių parodos, filmo užsienyje autorius; autorinio meno kūrinio (spektaklio, kino filmo, muzikinės kompozicijos) viešas demonstravimas užsienyje\nAuthor of personal exhibition of artwork or film abroad; public  demonstration of personal artwork (play, film, musical composition) abroad","vnt.\nunit",0,30,{"$f":"G72*H72","v":0}]
["Tab.Nr.",{"$f":"VLOOKUP($E$2,Source!$A$5:$B$78,2,FALSE)","v":"lll030900000"},0,4436]
["Tab.Nr.",{"$f":"VLOOKUP($E$2,Source!$A$5:$B$78,2,FALSE)","v":"lll030900000"},0,4437,"Autorinės meno kūrinių parodos, filmo Lietuvoje autorius; autorinio meno kūrinio (spektaklio, kino filmo, muzikinės kompozicijos) viešas demonstravimas Lietuvoje\nAuthor of personal exhibition of artwork or film in Lithuania; public  demonstration of personal artwork (play, film, musical composition) in Lithuania","vnt.\nunit",0,10,{"$f":"G74*H74","v":0}]
["Tab.Nr.",{"$f":"VLOOKUP($E$2,Source!$A$5:$B$78,2,FALSE)","v":"lll030900000"},0,4438]
["Tab.Nr.",{"$f":"VLOOKUP($E$2,Source!$A$5:$B$78,2,FALSE)","v":"lll030900000"},0,4439,"Tarptautinių festivalių, forumų, programų komisijos/komiteto pirmininkas\nCommittee chairperson of international festivals, forums, programmes ","vnt.\nunit",0,20,{"$f":"G76*H76","v":0}]
["Tab.Nr.",{"$f":"VLOOKUP($E$2,Source!$A$5:$B$78,2,FALSE)","v":"lll030900000"},0,4440]
["Tab.Nr.",{"$f":"VLOOKUP($E$2,Source!$A$5:$B$78,2,FALSE)","v":"lll030900000"},0,4441,"Tarptautinių festivalių, forumų, programų komisijos/komiteto narys\nCommittee member of international festivals, forums, programmes","vnt.\nunit",0,10,{"$f":"G78*H78","v":0}]
["Tab.Nr.",{"$f":"VLOOKUP($E$2,Source!$A$5:$B$78,2,FALSE)","v":"lll030900000"},0,4442]
["Tab.Nr.",{"$f":"VLOOKUP($E$2,Source!$A$5:$B$78,2,FALSE)","v":"lll030900000"},0,4443,"Kitų festivalių, forumų, programų komisijos/komiteto pirmininkas\nCommittee chairperson of other festivals, forums, programmes ","vnt.\nunit",0,10,{"$f":"G80*H80","v":0}]
[{"$f":"TRIM(MID($E$1,FIND(\"[\",$E$1,1)+1,FIND(\"]\",$E$1,1)-FIND(\"[\",$E$1,1)-1))","v":"Tab.Nr."},{"$f":"VLOOKUP($E$2,Source!$A$5:$B$78,2,FALSE)","v":"lll030900000"},{"$f":"$E$3","v":0},4444]
["Tab.Nr.",{"$f":"VLOOKUP($E$2,Source!$A$5:$B$78,2,FALSE)","v":"lll030900000"},0,4445,"Kitų festivalių, forumų, programų komisijos/komiteto narys\nCommittee member of other festivals, forums, programmes ","vnt.\nunit",0,5,{"$f":"G82*H82","v":0}]
["Tab.Nr.",{"$f":"VLOOKUP($E$2,Source!$A$5:$B$78,2,FALSE)","v":"lll030900000"},0,4446]
["Tab.Nr.",{"$f":"VLOOKUP($E$2,Source!$A$5:$B$78,2,FALSE)","v":"lll030900000"},0,4449,"Grupinės meno kūrinių parodos užsienyje dalyvis; kitų parodų (gėlių, knygų, nuotraukų ir  kt) organizavimas\nParticipant of group exhibition of artwork abroad; organising other exhibitions (of flowers, books, photos, etc.) abroad","vnt.\nunit",0,10,{"$f":"G84*H84","v":0}]
["Tab.Nr.",{"$f":"VLOOKUP($E$2,Source!$A$5:$B$78,2,FALSE)","v":"lll030900000"},0,4450]
["Tab.Nr.",{"$f":"VLOOKUP($E$2,Source!$A$5:$B$78,2,FALSE)","v":"lll030900000"},0,4451,"Grupinės meno kūrinių parodos Lietuvoje dalyvis; kitų parodų (gėlių, knygų, nuotraukų ir  kt) komisijos vertinimo narys\nParticipant of group exhibition of artwork in Lithuania; organising other exhibitions (of flowers, books, photos etc.) in Lithuania","vnt.\nunit",0,5,{"$f":"G86*H86","v":0}]
["Tab.Nr.",{"$f":"VLOOKUP($E$2,Source!$A$5:$B$78,2,FALSE)","v":"lll030900000"},0,4452]
["Tab.Nr.",{"$f":"VLOOKUP($E$2,Source!$A$5:$B$78,2,FALSE)","v":"lll030900000"},0,4453,"Dalyvavimas savanoriškoje vyriausybių, visuomeninių organizacijų veiklose; formalizuotas asmenų konsultavimas\nParticipation in voluntary activities of government and public organizations; formalised personal counselling ","vnt.\nunit",0,2,{"$f":"G88*H88","v":0}]
["Tab.Nr.",{"$f":"VLOOKUP($E$2,Source!$A$5:$B$78,2,FALSE)","v":"lll030900000"},0,4454]
["Tab.Nr.",{"$f":"VLOOKUP($E$2,Source!$A$5:$B$78,2,FALSE)","v":"lll030900000"},0,4455,"Padalinių internetinių svetainių administravimas\nAdministration of websites of university structural units","vnt.\nunit",0,10,{"$f":"G90*H90","v":0}]
["Tab.Nr.",{"$f":"VLOOKUP($E$2,Source!$A$5:$B$78,2,FALSE)","v":"lll030900000"},0,4456]
["Tab.Nr.",{"$f":"VLOOKUP($E$2,Source!$A$5:$B$78,2,FALSE)","v":"lll030900000"},0,4457,"Studentų konsultavimas psichologijos klinikoje, teisės mokslininkų būrelyje\nStudent counselling in psychology clinic, in law scientists club","vnt.\nunit",0,2,{"$f":"G92*H92","v":0}]
["Tab.Nr.",{"$f":"VLOOKUP($E$2,Source!$A$5:$B$78,2,FALSE)","v":"lll030900000"},0,4458]
[null,null,null,null,"Iš viso:\nTotal:",null,null,null,{"$f":"I72+I74+I76+I78+I80+I82+I84+I86+I88+I90+I92","v":0}]
[]
[null,null,null,null,"Studentų mokslinės veiklos organizavimas\nOrganising students research activities","Mat. vnt.\nMeasurement unit","Kiekis\nQuantity","Skiriami taškai\nPoints","Iš viso:\nTotal:"]
["Tab.Nr.",{"$f":"VLOOKUP($E$2,Source!$A$5:$B$78,2,FALSE)","v":"lll030900000"},0,4460,"Tarptautinių ir Lietuvos studentų meno, mokslinių renginių organizacinis vadovas\nChief organiser of international and Lithuanian students art and science events","vnt.\nunit",0,25,{"$f":"G97*H97","v":0}]
["Tab.Nr.",{"$f":"VLOOKUP($E$2,Source!$A$5:$B$78,2,FALSE)","v":"lll030900000"},0,4461]
["Tab.Nr.",{"$f":"VLOOKUP($E$2,Source!$A$5:$B$78,2,FALSE)","v":"lll030900000"},0,4462,"Studentų mokslinių draugijų įkūrimo organizatorius ir/ar vadovas\nHead and/or founder of students science societies","vnt.\nunit",0,10,{"$f":"G99*H99","v":0}]
["Tab.Nr.",{"$f":"VLOOKUP($E$2,Source!$A$5:$B$78,2,FALSE)","v":"lll030900000"},0,4463]
["Tab.Nr.",{"$f":"VLOOKUP($E$2,Source!$A$5:$B$78,2,FALSE)","v":"lll030900000"},0,4464,"Kitų studentų meno, mokslinių renginių organizacinis vadovas\nChief organiser of other students science events","vnt.\nunit",0,10,{"$f":"G101*H101","v":0}]
["Tab.Nr.",{"$f":"VLOOKUP($E$2,Source!$A$5:$B$78,2,FALSE)","v":"lll030900000"},0,4465]
["Tab.Nr.",{"$f":"VLOOKUP($E$2,Source!$A$5:$B$78,2,FALSE)","v":"lll030900000"},0,4466,"Studentų ir jaunųjų menininkų konkursinių darbų vadovas\nSupervisor of students' and young scientists' award-winning papers","vnt.\nunit",0,5,{"$f":"G103*H103","v":0}]
["Tab.Nr.",{"$f":"VLOOKUP($E$2,Source!$A$5:$B$78,2,FALSE)","v":"lll030900000"},0,4467]
[null,null,null,null,"Iš viso:\nTotal:",null,null,null,{"$f":"I97+I99+I101+I103","v":0}]
[]
[null,null,null,null,"Mokslininkų rengimas\nTraining of young researchers","Mat. vnt.\nMeasurement unit","Kiekis\nQuantity","Skiriami taškai\nPoints","Iš viso:\nTotal:"]
["Tab.Nr.",{"$f":"VLOOKUP($E$2,Source!$A$5:$B$78,2,FALSE)","v":"lll030900000"},0,4471,"Doktorantų, per vertinamąjį laikotarpį apgynusių disertacijas, mokslinis vadovas\nScientific supervisor of doctoral students who have defended their theses during the period which is being evaluated ","vnt.\nunit",0,25,{"$f":"G108*H108","v":0}]
["Tab.Nr.",{"$f":"VLOOKUP($E$2,Source!$A$5:$B$78,2,FALSE)","v":"lll030900000"},0,4472]
["Tab.Nr.",{"$f":"VLOOKUP($E$2,Source!$A$5:$B$78,2,FALSE)","v":"lll030900000"},0,4473,"Doktorantų, per vertinamąjį laikotarpį apgynusių disertacijas, konsultantas\nConsultant of doctoral students who have defended their theses during the period which is being evaluated ","vnt.\nunit",0,10,{"$f":"G110*H110","v":0}]
["Tab.Nr.",{"$f":"VLOOKUP($E$2,Source!$A$5:$B$78,2,FALSE)","v":"lll030900000"},0,4474]
["Tab.Nr.",{"$f":"VLOOKUP($E$2,Source!$A$5:$B$78,2,FALSE)","v":"lll030900000"},0,4475,"Doktorantų vasaros mokyklos organizatorius\nOrganiser of a summer school for doctoral students","vnt.\nunit",0,20,{"$f":"G112*H112","v":0}]
["Tab.Nr.",{"$f":"VLOOKUP($E$2,Source!$A$5:$B$78,2,FALSE)","v":"lll030900000"},0,4476]
["Tab.Nr.",{"$f":"VLOOKUP($E$2,Source!$A$5:$B$78,2,FALSE)","v":"lll030900000"},0,4477,"Doktorantūros (jungtinės) mokslo krypties komisijos pirmininkas\nChairperson of a joint doctoral committee in a science field","vnt.\nunit",0,15,{"$f":"G114*H114","v":0}]
["Tab.Nr.",{"$f":"VLOOKUP($E$2,Source!$A$5:$B$78,2,FALSE)","v":"lll030900000"},0,4478]
["Tab.Nr.",{"$f":"VLOOKUP($E$2,Source!$A$5:$B$78,2,FALSE)","v":"lll030900000"},0,4479,"Doktorantūros (jungtinės) mokslo krypties komisijos narys\nChairperson of a joint doctoral committee in a science field","vnt.\nunit",0,5,{"$f":"G116*H116","v":0}]
["Tab.Nr.",{"$f":"VLOOKUP($E$2,Source!$A$5:$B$78,2,FALSE)","v":"lll030900000"},0,4480]
["Tab.Nr.",{"$f":"VLOOKUP($E$2,Source!$A$5:$B$78,2,FALSE)","v":"lll030900000"},0,4481,"Daktaro disertacijų oponentas\nOpponent of doctoral dissertation","vnt.\nunit",0,5,{"$f":"G118*H118","v":0}]
["Tab.Nr.",{"$f":"VLOOKUP($E$2,Source!$A$5:$B$78,2,FALSE)","v":"lll030900000"},0,4482]
["Tab.Nr.",{"$f":"VLOOKUP($E$2,Source!$A$5:$B$78,2,FALSE)","v":"lll030900000"},0,4483,"Daktaro disertacijų gynimo tarybos narys\nMember of doctoral dissertation defence board","vnt.\nunit",0,3,{"$f":"G120*H120","v":0}]
{"$rows_left_out":280}
{"sheet":"Source","index":1,"n_rows":78,"n_cols":5,"rows_kept":78,"cut":false,"hidden":true,"merged":[]}
[null,null,null,"Nuo","Iki"]
["Metai",2015,null,0,1000]
[null,null,null,0,1]
["Katedros (centrai)","Kodai"]
["Anglų filologijos katedra","lll030900000","HMF"]
["Aplinkos tyrimų centras","lll050400000","GMF"]
["Aplinkotyros katedra","lll050500000","GMF"]
["Azijos studijų centras","lll080600000","PMDF"]
["Bažnytinės teisės katedra","lll070600000","KTF"]
["Bendrosios psichologijos katedra","lll090200000","SMF"]
["Biochemijos katedra","lll050800000","GMF"]
["Biologijos katedra","lll050300000","GMF"]
["Č. Milošo slavistikos centras","lll030700000","PMDF"]
["Dainavimo katedra","lll060100000","MA"]
["Džiazo katedra","lll060200000","MA"]
["Edukologijos katedra","lll090100000","SMF"]
["Ekonomikos katedra","lll020100000","EVF"]
["Energetinio saugumo tyrimų centras","ll2830000000","VDU"]
["Europos studijų centras","lll080500000","PMDF"]
["Filosofijos katedra","lll031000000","HMF"]
["Finansų katedra","lll020200000","EVF"]
["Fizikos katedra","lll050100000","GMF"]
["Fortepijono katedra","lll060300000","MA"]
["Germanistikos ir romanistikos katedra","lll032300000","HMF"]
["Inovatyvių studijų institutas","ll2600000000","ISC"]
["Instrumentinės muzikos katedra","lll060500000","MA"]
["Istorijos katedra","lll031100000","HMF"]
["Karjeros ir kompetencijų centras","ll2820000000","VDU"]
["Kauno Botanikos sodas","lll150000000","VDU"]
["Kauno istorijos centras","lll032200000","HMF"]
["Kokybės ir inovacijų centras","ll2590000000","SMF"]
["Kompiuterinės lingvistikos centras","lll030500000","HMF"]
["Krikščioniško ugdymo centras","lll071000000","KTF"]
["Kultūros tyrimų centras","lll031300000","HMF"]
["Kultūrų studijų ir etnologijos katedra","lll032400000","HMF"]
["Letonikos centras","lll081200000","HMF"]
["Lietuvių išeivijos institutas","lll140000000","HMF"]
["Lietuvių kalbos katedra","lll030100000","HMF"]
["Lietuvių literatūros katedra","lll030200000","HMF"]
["LKB istorijos centras","lll070501000","KTF"]
["Marketingo katedra","lll020600000","EVF"]
["Matematikos ir statistikos katedra","lll040200000","IF"]
["Menotyros katedra","lll160100000","MF"]
["Muzikos teorijos ir pedagogikos katedra","lll060400000","MA"]
["Pilietinės tolerancijos centras","lll031400000","PMDF"]
["Politologijos katedra","lll080100000","PMDF"]
["Privatinės teisės katedra","lll102000000","TF"]
["Prof. B.Vaškelio literatūrinės komparatyvistikos centras","lll031600000","HMF"]
["Profesinio rengimo studijų centras","lll090500000","SMF"]
["Psichologijos klinika","lll090800000","SMF"]
["Regionistikos katedra","lll080700000","PMDF"]
["Religijos studijų katedra","lll070100000","KTF"]
["Santuokos ir šeimos studijų centras","lll070900000","KTF"]
["Sistemų analizės katedra","lll040600000","IF"]
["Socialinės antropologijos centras","lll090700000","SMF"]
["Socialinės ir politinės teorijos katedra","lll081000000","PMDF"]
["Socialinio darbo katedra","lll110100000","SMF"]
["Socialinio darbo kompetencijų centras","lll110500000","SMF -> SGI"]
["Socialinių tyrimų centras","lll080400000","SMF"]
["Sociologijos katedra","lll090300000","SMF"]
["Sporto centras","ll2080000000","VDU"]
["Statistinių tyrimų centras","lll040300000","IF"]
["Studijų kokybės centras","ll2340000000","VDU"]
["Šiuolaikinių menų katedra","lll160400000","MF"]
["Šiuolaikinių menų katedra","lll160400000","MA"]
["Švietimo studijų centras","lll090400000","SMF"]
["Taikomosios informatikos katedra","lll040100000","IF"]
["Tarpkultūrinės komunikacijos ir daugiakalbystės tyrimų centras","lll081100000","PMDF"]
["Teatrologijos katedra","lll160200000","MF"]
["Teologijos katedra","lll070200000","KTF"]
["Teorinės psichologijos katedra","lll090900000","SMF"]
["Tęstinių studijų centras","lll091100000","VDU"]
["Užsienio kalbų institutas","lll170000000","UKI"]
["Vadybos katedra","lll020300000","EVF"]
["Verslo konsultavimo ir podiplominių studijų centras","lll020400000","EVF"]
["Viešojo administravimo katedra","lll080300000","PMDF"]
["Viešosios komunikacijos katedra","lll080900000","PMDF"]
["Viešosios teisės katedra","lll103000000","TF"]